{"text_format":"1","workbook":"xlsx","n_sheets":8,"sheets":["Notes","Lancashire district LE at birth","Lancashire district LE at 65","LE Estimates by MSOA","Healthy Life Expectancy","LE v HLE","Lookups","MSOA figures"],"not_rendered":{"charts":9,"images":7,"macros":1,"external_links":1,"defined_names":11,"comments":0,"pivot_tables":1},"unopened":[],"bounds":{"document_bytes":16777216,"sheet_cells":100000,"rows_first":2000,"rows_last":500,"rows_between":2000,"halvings":0,"cell_chars":16384,"cell_head_chars":4096},"cells_cut":0,"cells_raw":0,"read":"whole","date_system":"1900"}

{"sheet":"Notes","index":0,"n_rows":25,"n_cols":12,"rows_kept":25,"cut":false,"hidden":false,"merged":[[0,0,2,16],[3,0,14,16],[16,0,16,9],[18,0,18,9],[24,10,26,15],[20,0,20,9],[20,10,20,16]]}
["Life expectancy estimates"]
[]
[]
["Life expectancy at birth has been used as a measure of the health status of the population in England and Wales since the 1840s. It was employed in some of the earliest reports of the Registrar General to illustrate the differences in mortality experienced by populations in different parts of the country. The tradition of using life expectancy as an indicator of geographic inequalities in health has been continued by the office for national statistics (ONS) since 2001, with the publication of sub-national life expectancy statistics. Period life expectancy at a given age for an area is the average number of years a person would live, if he or she experienced the particular area's age-specific mortality rates for that time period throughout his or her life.  Meaning there is no guarantee that if the area you live in, has a life expectancy of 80, that you will live for 80 years.\n\n Several studies have shown that geographical variations in life expectancy can largely be accounted for by individual and area-based deprivation. The Marmot Review published in 2010 highlighted the fact that people living in the poorest neighbourhoods will on average, die seven years earlier than people living in the richest neighbourhoods. The difference in disability-free life expectancy is even greater, with the average difference between the most and least deprived areas being 17 years. This means people in poorer areas not only die sooner, but they will also spend more of their lives living with a disability. For society to have a healthy population it is essential to take action to both raise the general level of health and flatten the social gradient"]
[]
[]
[]
[]
[]
[]
[]
[]
[]
[]
[]
[]
["The tables and charts in this document have been produced using figures realised by the Office for National Statistics (ONS)"]
[]
["Life expectancy at birth and at age 65 by local areas in England and Wales, 2012 to 2014"]
["Health Expectancies at birth by Middle Layer Super Output Areas, England, Inequality in Health and Life Expectancies within Upper Tier Local Authorities: 2009 to 2013"]
["Healthy life expectancy (HLE) and life expectancy (LE) at birth by upper tier local authority (UTLA) 2012-2014"]
[]
["For further information, analysis and questions please contact the public health knowledge and intelligence team via",null,null,null,null,null,null,null,null,null,null,"phknowledge@lancashire.gov.uk "]
[]
[null,null,null,null,null,null,null,null,null,null,"Last updated : 16 / 03 / 2016"]

{"sheet":"Lancashire district LE at birth","index":1,"n_rows":66,"n_cols":16,"rows_kept":66,"cut":false,"hidden":false,"merged":[[61,11,61,12],[62,11,62,12],[63,11,63,12],[64,11,64,12],[65,11,65,12],[47,0,49,12],[55,11,55,12],[56,11,56,12],[57,11,57,12],[16,11,16,12],[17,11,17,12],[18,11,18,12],[19,11,19,12],[20,11,20,12],[21,11,21,12],[58,11,58,12],[59,11,59,12],[60,11,60,12],[50,11,50,12],[51,11,51,12],[52,11,52,12],[53,11,53,12],[54,11,54,12],[15,11,15,12],[0,0,2,12],[6,11,6,12],[7,11,7,12],[8,11,8,12],[9,11,9,12],[3,0,5,12],[10,11,10,12],[11,11,11,12],[12,11,12,12],[13,11,13,12],[14,11,14,12]]}
["District level estimated life expectancy at birth 2012-2014"]
[]
[]
["Female life expectancy at birth"]
[]
[]
["Area","Life expectancy at birth","Lower confidence limit","L2","Upper confidence limit","U2","England","North west","Significance","National rank","Local rank","Difference from male rate (Y)",null,null,"England"]
["England",83.196029663085895,83.169601440429602,{"$f":"B8-C8","v":2.6428222656292633E-2},83.222457885742102,{"$f":"E8-B8","v":2.6428222656207367E-2},83.196029663085895,81.900000000000006,"-","-","-",{"$f":"B8-B52","v":3.6501541137694886},null,null,{"$f":"$B$8","v":83.196029663085895}]
["North West",81.900000000000006,81.8,{"$f":"B9-C9","v":0.10000000000000853},81.900000000000006,{"$f":"E9-B9","v":0},83.196029663085895,81.900000000000006,"Significantly below England value","8/9","-",{"$f":"B9-B53","v":3.8000000000000114},null,null,{"$f":"$B$8","v":83.196029663085895},{"$f":"IF($C$8>E9,\"Significantly below England value\",IF($E$8<C9,\"Significantly above England value\",\"No significant difference from England value\"))","v":"Significantly below England value"}]
["Lancashire county",82.1,81.900000000000006,0.19999999999998863,82.3,0.20000000000000284,83.196029663085895,81.900000000000006,"Significantly below England value","28/33","-",3.5999999999999943,null,null,83.196029663085895,{"$f":"IF($C$8>E10,\"Significantly below England value\",IF($E$8<C10,\"Significantly above England value\",\"No significant difference from England value\"))","v":"Significantly below England value"}]
["Burnley",80.099999999999994,79.400000000000006,0.69999999999998863,80.8,0.70000000000000284,83.196029663085895,81.900000000000006,"Significantly below England value","321/324",{"$f":"RANK(B11,$B$11:$B$22) & \"/\" & COUNTA($B$11:$B$22)","v":"12/12"},4,null,null,83.196029663085895,"Significantly below England value"]
["Chorley",82.4,81.8,0.60000000000000853,82.9,0.5,83.196029663085895,81.900000000000006,"Significantly below England value","249/324",{"$f":"RANK(B12,$B$11:$B$22) & \"/\" & COUNTA($B$11:$B$22)","v":"5/12"},3.4000000000000057,null,null,83.196029663085895,"Significantly below England value"]
["Fylde",82.6,81.900000000000006,0.69999999999998863,83.3,0.70000000000000284,83.196029663085895,81.900000000000006,"No significant difference from England value","234/324","4/12",2.8999999999999915,null,null,83.196029663085895,"No significant difference from England value"]
["Hyndburn",81.099999999999994,80.400000000000006,0.69999999999998863,81.8,0.70000000000000284,83.196029663085895,81.900000000000006,"Significantly below England value","308/324","11/12",4.5999999999999943,null,null,83.196029663085895,"Significantly below England value"]
["Lancaster",81.900000000000006,81.400000000000006,0.5,82.4,0.5,83.196029663085895,81.900000000000006,"Significantly below England value","281/324","8/12",3.8000000000000114,null,null,83.196029663085895,"Significantly below England value"]
["Pendle",81.900000000000006,81.2,0.70000000000000284,82.5,0.59999999999999432,83.196029663085895,81.900000000000006,"Significantly below England value","281/324","8/12",4.1000000000000085,null,null,83.196029663085895,"Significantly below England value"]
["Preston",81.3,80.8,0.5,81.900000000000006,0.60000000000000853,83.196029663085895,81.900000000000006,"Significantly below England value","303/324","10/12",3.8999999999999915,null,null,83.196029663085895,"Significantly below England value"]
["Ribble Valley",83.2,82.3,0.90000000000000568,84.2,1,83.196029663085895,81.900000000000006,"No significant difference from England value","188/324","2/12",2,null,null,83.196029663085895,"No significant difference from England value"]
["Rossendale",82.4,81.8,0.60000000000000853,83.1,0.69999999999998863,83.196029663085895,81.900000000000006,"Significantly below England value","249/324","5/12",4.7000000000000028,null,null,83.196029663085895,"Significantly below England value"]
["South Ribble",83.3,82.8,0.5,83.9,0.60000000000000853,83.196029663085895,81.900000000000006,"No significant difference from England value","174/324","1/12",3.0999999999999943,null,null,83.196029663085895,"No significant difference from England value"]
["West Lancashire",82.8,82.2,0.59999999999999432,83.3,0.5,83.196029663085895,81.900000000000006,"No significant difference from England value","222/324","3/12",3.2000000000000028,null,null,83.196029663085895,"No significant difference from England value"]
["Wyre",82.2,81.599999999999994,0.60000000000000853,82.8,0.59999999999999432,83.196029663085895,81.900000000000006,"Significantly below England value","262/324","7/12",3.5,null,null,83.196029663085895,"Significantly below England value"]
[]
[]
[]
[]
[]
[]
[]
[]
[]
[]
[]
[]
[]
[]
[]
[]
[]
[]
[]
[]
[]
[]
[]
[]
[]
["Male life expectancy at birth"]
[]
[]
["Area","Life expectancy at birth","Lower confidence limit","L2","Upper confidence limit","U2","England","North west","Significance","National rank","Local rank","Difference from female rate (Y)",null,null,"England"]
["England",79.545875549316406,79.517311096191406,2.8564453125E-2,79.574440002441406,2.8564453125E-2,79.545875549316406,78.099999999999994,"-","-","-",{"$f":"B52-B8","v":-3.6501541137694886},null,null,{"$f":"$B$52","v":79.545875549316406}]
["North West",78.099999999999994,78,{"$f":"B53-C53","v":9.9999999999994316E-2},78.2,{"$f":"E53-B53","v":0.10000000000000853},79.545875549316406,78.099999999999994,"Significantly below England value","8/9","-",{"$f":"B53-B9","v":-3.8000000000000114},null,null,{"$f":"$B$52","v":79.545875549316406},{"$f":"IF($C$52>E53,\"Significantly below England value\",IF($E$52<C53,\"Significantly above England value\",\"No significant difference from England value\"))","v":"Significantly below England value"}]
["Lancashire county",78.5,78.3,0.20000000000000284,78.7,0.20000000000000284,79.545875549316406,78.099999999999994,"Significantly below England value","27/33","-",-3.5999999999999943,null,null,79.545875549316406,{"$f":"IF($C$52>E54,\"Significantly below England value\",IF($E$52<C54,\"Significantly above England value\",\"No significant difference from England value\"))","v":"Significantly below England value"}]
["Burnley",76.099999999999994,75.400000000000006,0.69999999999998863,76.900000000000006,0.80000000000001137,79.545875549316406,78.099999999999994,"Significantly below England value","322/324",{"$f":"RANK(B55,$B$55:$B$66) & \"/\" & COUNTA($B$55:$B$66)","v":"12/12"},-4,null,null,79.545875549316406,"Significantly below England value"]
["Chorley",79,78.400000000000006,0.59999999999999432,79.599999999999994,0.59999999999999432,79.545875549316406,78.099999999999994,"No significant difference from England value","218/324",{"$f":"RANK(B56,$B$55:$B$66) & \"/\" & COUNTA($B$55:$B$66)","v":"5/12"},-3.4000000000000057,null,null,79.545875549316406,"No significant difference from England value"]
["Fylde",79.7,78.900000000000006,0.79999999999999716,80.400000000000006,0.70000000000000284,79.545875549316406,78.099999999999994,"No significant difference from England value","174/324","3/12",-2.8999999999999915,null,null,79.545875549316406,"No significant difference from England value"]
["Hyndburn",76.5,75.8,0.70000000000000284,77.3,0.79999999999999716,79.545875549316406,78.099999999999994,"Significantly below England value","319/324","11/12",-4.5999999999999943,null,null,79.545875549316406,"Significantly below England value"]
["Lancaster",78.099999999999994,77.599999999999994,0.5,78.7,0.60000000000000853,79.545875549316406,78.099999999999994,"Significantly below England value","273/324","7/12",-3.8000000000000114,null,null,79.545875549316406,"Significantly below England value"]
["Pendle",77.8,77,0.79999999999999716,78.599999999999994,0.79999999999999716,79.545875549316406,78.099999999999994,"Significantly below England value","289/324","8/12",-4.1000000000000085,null,null,79.545875549316406,"Significantly below England value"]
["Preston",77.400000000000006,76.8,0.60000000000000853,78,0.59999999999999432,79.545875549316406,78.099999999999994,"Significantly below England value","301/324","10/12",-3.8999999999999915,null,null,79.545875549316406,"Significantly below England value"]
["Ribble Valley",81.2,80.5,0.70000000000000284,82,0.79999999999999716,79.545875549316406,78.099999999999994,"Significantly above England value","65/324","1/12",-2,null,null,79.545875549316406,"Significantly above England value"]
["Rossendale",77.7,76.900000000000006,0.79999999999999716,78.5,0.79999999999999716,79.545875549316406,78.099999999999994,"Significantly below England value","292/324","9/12",-4.7000000000000028,null,null,79.545875549316406,"Significantly below England value"]
["South Ribble",80.2,79.599999999999994,0.60000000000000853,80.900000000000006,0.70000000000000284,79.545875549316406,78.099999999999994,"Significantly above England value","134/324","2/12",-3.0999999999999943,null,null,79.545875549316406,"Significantly above England value"]
["West Lancashire",79.599999999999994,79,0.59999999999999432,80.2,0.60000000000000853,79.545875549316406,78.099999999999994,"No significant difference from England value","185/324","4/12",-3.2000000000000028,null,null,79.545875549316406,"No significant difference from England value"]
["Wyre",78.7,78.099999999999994,0.60000000000000853,79.400000000000006,0.70000000000000284,79.545875549316406,78.099999999999994,"Significantly below England value","237/324","6/12",-3.5,null,null,79.545875549316406,"Significantly below England value"]

{"sheet":"Lancashire district LE at 65","index":2,"n_rows":65,"n_cols":14,"rows_kept":65,"cut":false,"hidden":false,"merged":[[15,11,15,12],[16,11,16,12],[17,11,17,12],[18,11,18,12],[0,0,2,12],[6,11,6,12],[7,11,7,12],[8,11,8,12],[9,11,9,12],[3,0,5,12],[10,11,10,12],[11,11,11,12],[12,11,12,12],[13,11,13,12],[14,11,14,12],[19,11,19,12],[20,11,20,12],[59,11,59,12],[46,0,48,12],[49,11,49,12],[50,11,50,12],[51,11,51,12],[52,11,52,12],[53,11,53,12],[54,11,54,12],[21,11,21,12],[62,11,62,12],[63,11,63,12],[64,11,64,12],[55,11,55,12],[56,11,56,12],[57,11,57,12],[58,11,58,12],[60,11,60,12],[61,11,61,12]]}
["District level estimated life expectancy at birth 2012-2014"]
[]
[]
["Female life expectancy at 65"]
[]
[]
["Area","Life expectancy at 65","Lower confidence limit","L2","Upper confidence limit","U2","England","North west","Significance","National rank","Local rank","Difference from male rate (Y)"]
["England",21.1877422332763,21.169935226440401,1.780700683589842E-2,21.205549240112301,1.7807006836001449E-2,21.1877422332763,20.3,"-","-","-",{"$f":"B8-B51","v":2.4170799255370987}]
["North West",20.3,20.2,0.10000000000000142,20.3,0,21.1877422332763,20.3,"Significantly below England value","8/9","-",2.3000000000000007,null,{"$f":"IF($C$8>E9,\"Significantly below England value\",IF($E$8<C9,\"Significantly above England value\",\"No significant difference from England value\"))","v":"Significantly below England value"}]
["Lancashire",20.399999999999999,20.3,9.9999999999997868E-2,20.5,0.10000000000000142,21.1877422332763,20.3,"Significantly below England value","28/33","-",2.1999999999999993,null,{"$f":"IF($C$8>E10,\"Significantly below England value\",IF($E$8<C10,\"Significantly above England value\",\"No significant difference from England value\"))","v":"Significantly below England value"}]
["Burnley",19,18.600000000000001,0.39999999999999858,19.399999999999999,0.39999999999999858,21.1877422332763,20.3,"Significantly below England value","321/324",{"$f":"RANK(B11,$B$11:$B$22) & \"/\" & COUNTA($B$11:$B$22)","v":"12/12"},2,null,"Significantly below England value"]
["Chorley",20.399999999999999,20,0.39999999999999858,20.7,0.30000000000000071,21.1877422332763,20.3,"Significantly below England value","271/324","7/12",2.0999999999999979,null,"Significantly below England value"]
["Fylde",20.7,20.3,0.39999999999999858,21.1,0.40000000000000213,21.1877422332763,20.3,"Significantly below England value","238/324","4/12",2,null,"Significantly below England value"]
["Hyndburn",19.7,19.2,0.5,20.100000000000001,0.40000000000000213,21.1877422332763,20.3,"Significantly below England value","307/324","11/12",2.5,null,"Significantly below England value"]
["Lancaster",20.2,19.899999999999999,0.30000000000000071,20.5,0.30000000000000071,21.1877422332763,20.3,"Significantly below England value","284/324","8/12",2.0999999999999979,null,"Significantly below England value"]
["Pendle",20.5,20.100000000000001,0.39999999999999858,20.9,0.39999999999999858,21.1877422332763,20.3,"Significantly below England value","256/324","6/12",2.3000000000000007,null,"Significantly below England value"]
["Preston",19.899999999999999,19.5,0.39999999999999858,20.3,0.40000000000000213,21.1877422332763,20.3,"Significantly below England value","303/324","10/12",2.5,null,"Significantly below England value"]
["Ribble Valley",21.7,21.2,0.5,22.1,0.40000000000000213,21.1877422332763,20.3,"No significant difference from England value","118/324","1/12",2.5,null,"No significant difference from England value"]
["Rossendale",20,19.5,0.5,20.5,0.5,21.1877422332763,20.3,"Significantly below England value","298/324","9/12",2.3999999999999986,null,"Significantly below England value"]
["South Ribble",21.3,20.9,0.40000000000000213,21.6,0.30000000000000071,21.1877422332763,20.3,"No significant difference from England value","164/324","2/12",1.8000000000000007,null,"No significant difference from England value"]
["West Lancashire",20.7,20.399999999999999,0.30000000000000071,21.1,0.40000000000000213,21.1877422332763,20.3,"Significantly below England value","238/324","4/12",2.3000000000000007,null,"Significantly below England value"]
["Wyre",21,20.7,0.30000000000000071,21.3,0.30000000000000071,21.1877422332763,20.3,"No significant difference from England value","201/324","3/12",2.6000000000000014,null,"No significant difference from England value"]
[]
[]
[]
[]
[]
[]
[]
[]
[]
[]
[]
[]
[]
[]
[]
[]
[]
[]
[]
[]
[]
[]
[]
[]
["Male life expectancy at 65"]
[]
[]
["Area","Life expectancy at 65","Lower confidence limit","L2","Upper confidence limit","U2","England","North west","Significance","National rank","Local rank","Difference from female rate (Y)"]
["England",18.770662307739201,18.751834869384702,{"$f":"B51-C51","v":1.8827438354499293E-2},18.78948974609375,{"$f":"E51-B51","v":1.8827438354549031E-2},18.770662307739201,18,"-","-","-",{"$f":"B51-B8","v":-2.4170799255370987}]
["North West",18,17.899999999999999,{"$f":"B52-C52","v":0.10000000000000142},18,{"$f":"E52-B52","v":0},18.770662307739201,18,"Significantly below England value","8/9","-",-2.3000000000000007,null,{"$f":"IF($C$51>E52,\"Significantly below England value\",IF($E$51<C52,\"Significantly above England value\",\"No significant difference from England value\"))","v":"Significantly below England value"}]
["Lancashire",18.2,18.100000000000001,9.9999999999997868E-2,18.3,0.10000000000000142,18.770662307739201,18,"Significantly below England value","27/33","-",-2.1999999999999993,null,{"$f":"IF($C$51>E53,\"Significantly below England value\",IF($E$51<C53,\"Significantly above England value\",\"No significant difference from England value\"))","v":"Significantly below England value"}]
["Burnley",17,16.5,0.5,17.399999999999999,0.39999999999999858,18.770662307739201,18,"Significantly below England value","317/324",{"$f":"RANK(B54,$B$54:$B$65) & \"/\" & COUNTA($B$54:$B$65)","v":"12/12"},-2,null,"Significantly below England value"]
["Chorley",18.3,18,0.30000000000000071,18.7,0.39999999999999858,18.770662307739201,18,"Significantly below England value","230/324","6/12",-2.0999999999999979,null,"Significantly below England value"]
["Fylde",18.7,18.3,0.39999999999999858,19.100000000000001,0.40000000000000213,18.770662307739201,18,"No significant difference from England value","187/324","3/12",-2,null,"No significant difference from England value"]
["Hyndburn",17.2,16.8,0.39999999999999858,17.7,0.5,18.770662307739201,18,"Significantly below England value","311/324","11/12",-2.5,null,"Significantly below England value"]
["Lancaster",18.100000000000001,17.8,0.30000000000000071,18.5,0.39999999999999858,18.770662307739201,18,"Significantly below England value","251/324","8/12",-2.0999999999999979,null,"Significantly below England value"]
["Pendle",18.2,17.8,0.39999999999999858,18.7,0.5,18.770662307739201,18,"Significantly below England value","237/324","7/12",-2.3000000000000007,null,"Significantly below England value"]
["Preston",17.399999999999999,17,0.39999999999999858,17.8,0.40000000000000213,18.770662307739201,18,"Significantly below England value","304/324","10/12",-2.5,null,"Significantly below England value"]
["Ribble Valley",19.2,18.7,0.5,19.7,0.5,18.770662307739201,18,"No significant difference from England value","131/324","2/12",-2.5,null,"No significant difference from England value"]
["Rossendale",17.600000000000001,17.100000000000001,0.5,18.100000000000001,0.5,18.770662307739201,18,"Significantly below England value","295/324","9/12",-2.3999999999999986,null,"Significantly below England value"]
["South Ribble",19.5,19.100000000000001,0.39999999999999858,19.899999999999999,0.39999999999999858,18.770662307739201,18,"Significantly above England value","87/324","1/12",-1.8000000000000007,null,"Significantly above England value"]
["West Lancashire",18.399999999999999,18,0.39999999999999858,18.7,0.30000000000000071,18.770662307739201,18,"Significantly below England value","213/324","4/12",-2.3000000000000007,null,"Significantly below England value"]
["Wyre",18.399999999999999,18.100000000000001,0.29999999999999716,18.8,0.40000000000000213,18.770662307739201,18,"No significant difference from England value","213/324","4/12",-2.6000000000000014,null,"No significant difference from England value"]

{"sheet":"LE Estimates by MSOA","index":3,"n_rows":64,"n_cols":13,"rows_kept":64,"cut":false,"hidden":false,"merged":[[63,0,63,6],[38,0,39,18],[4,1,4,2],[5,1,5,2],[0,0,2,18]]}
["MSOA level estimated life expectancy at birth 2009-2013"]
[]
[]
[]
[null,"<< Select district"]
[null,"<< Select gender"]
[]
["England","Estimated LE","Lower CI","Upper CI"]
["Female",82.971779999999995,82.950909999999993,82.992660000000001]
["Male",79.134870000000006,79.11233,79.157409999999999]
[{"$f":"B14","v":"Male"}]
[]
["LA","Preston"]
["Gender","Male"]
[]
[]
["MSOA Names","LE","Lower CI","Upper CI","Significance"]
["Preston 001",80.464730000000003,78.668319999999994,82.261129999999994,"NoDiff"]
["Preston 002",82.564319999999995,80.319640000000007,84.809010000000001,"Better"]
["Preston 003",82.330740000000006,80.823239999999998,83.838239999999999,"Better"]
["Preston 004",76.902460000000005,75.061300000000003,78.743629999999996,"Worse"]
["Preston 005",75.316010000000006,73.446849999999998,77.185180000000003,"Worse"]
["Preston 006",79.938689999999994,78.514200000000002,81.363190000000003,"NoDiff"]
["Preston 007",78.509439999999998,76.747649999999993,80.271230000000003,"NoDiff"]
["Preston 008",80.034239999999997,78.342510000000004,81.725980000000007,"NoDiff"]
["Preston 009",72.946349999999995,71.232600000000005,74.660089999999997,"Worse"]
["Preston 010",76.508129999999994,74.169449999999998,78.846800000000002,"Worse"]
["Preston 011",74.701480000000004,72.507260000000002,76.895700000000005,"Worse"]
["Preston 012",77.338329999999999,75.508409999999998,79.16825,"Worse"]
["Preston 013",76.418589999999995,74.634320000000002,78.202870000000004,"Worse"]
["Preston 014",72.911959999999993,70.902360000000002,74.921549999999996,"Worse"]
["Preston 015",76.632159999999999,73.922910000000002,79.341409999999996,"Worse"]
["Preston 016",77.051190000000005,75.002650000000003,79.099729999999994,"Worse"]
["Preston 017",74.007320000000007,71.899420000000006,76.115219999999994,"Worse"]
[]
[]
[]
[{"$f":"A39","v":"Preston Male MSOA Life expectancy estimates 2009-13"}]
[{"$f":"B13  & \" \" &  B14 & \" MSOA Life expectancy estimates 2009-13\"","v":"Preston Male MSOA Life expectancy estimates 2009-13"}]
[]
["MSOA Name","Estimated LE","Lower CI","Upper CI","Significance","IMD Quintile",null,"L2","U2","England","Better","NoDiff","Worse"]
["England",{"$f":"SUM(IF($A$9:$A$10=$A11,IF($B$8:$D$8=$B41,$B$9:$D$10)))","v":79.134870000000006},{"$f":"SUM(IF($A$9:$A$10=$A11,IF($B$8:$D$8=$C41,$B$9:$D$10)))","v":79.11233},{"$f":"SUM(IF($A$9:$A$10=$A11,IF($B$8:$D$8=$D41,$B$9:$D$10)))","v":79.157409999999999},"-","-",null,{"$f":"B42-C42","v":2.2540000000006444E-2},{"$f":"D42-B42","v":2.2539999999992233E-2},{"$f":"IF(B42=\"\", \" \",$B$42)","v":79.134870000000006},{"$error":"#N/A"},{"$error":"#N/A"},{"$error":"#N/A"}]
["Preston 001",80.464730000000003,78.668319999999994,82.261129999999994,"NoDiff",{"$f":"IF(ISNA(VLOOKUP(A43,'MSOA figures'!$B$1:$L$309,11,FALSE)),\"\",VLOOKUP(A43,'MSOA figures'!$B$1:$L$309,11,FALSE))","v":4},null,1.7964100000000087,1.7963999999999913,null,{"$f":"IF($E43=$K$41,$B43,#N/A)","v":{"$error":"#N/A"}},{"$f":"IF($E43=$L$41,$B43,#N/A)","v":80.464730000000003},{"$f":"IF($E43=$M$41,$B43,#N/A)","v":{"$error":"#N/A"}}]
["Preston 002",82.564319999999995,80.319640000000007,84.809010000000001,"Better",{"$f":"IF(ISNA(VLOOKUP(A44,'MSOA figures'!$B$1:$L$309,11,FALSE)),\"\",VLOOKUP(A44,'MSOA figures'!$B$1:$L$309,11,FALSE))","v":5},null,2.2446799999999882,2.2446900000000056,null,{"$f":"IF(E44=$K$41,B44,#N/A)","v":82.564319999999995},{"$f":"IF($E44=$L$41,$B44,#N/A)","v":{"$error":"#N/A"}},{"$f":"IF($E44=$M$41,$B44,#N/A)","v":{"$error":"#N/A"}}]
["Preston 003",82.330740000000006,80.823239999999998,83.838239999999999,"Better",{"$f":"IF(ISNA(VLOOKUP(A45,'MSOA figures'!$B$1:$L$309,11,FALSE)),\"\",VLOOKUP(A45,'MSOA figures'!$B$1:$L$309,11,FALSE))","v":5},null,1.5075000000000074,1.5074999999999932,null,82.330740000000006,{"$error":"#N/A"},{"$error":"#N/A"}]
["Preston 004",76.902460000000005,75.061300000000003,78.743629999999996,"Worse",{"$f":"IF(ISNA(VLOOKUP(A46,'MSOA figures'!$B$1:$L$309,11,FALSE)),\"\",VLOOKUP(A46,'MSOA figures'!$B$1:$L$309,11,FALSE))","v":5},null,1.8411600000000021,1.8411699999999911,null,{"$error":"#N/A"},{"$error":"#N/A"},76.902460000000005]
["Preston 005",75.316010000000006,73.446849999999998,77.185180000000003,"Worse",{"$f":"IF(ISNA(VLOOKUP(A47,'MSOA figures'!$B$1:$L$309,11,FALSE)),\"\",VLOOKUP(A47,'MSOA figures'!$B$1:$L$309,11,FALSE))","v":1},null,1.8691600000000079,1.8691699999999969,null,{"$error":"#N/A"},{"$error":"#N/A"},75.316010000000006]
["Preston 006",79.938689999999994,78.514200000000002,81.363190000000003,"NoDiff",{"$f":"IF(ISNA(VLOOKUP(A48,'MSOA figures'!$B$1:$L$309,11,FALSE)),\"\",VLOOKUP(A48,'MSOA figures'!$B$1:$L$309,11,FALSE))","v":4},null,1.4244899999999916,1.424500000000009,null,{"$error":"#N/A"},79.938689999999994,{"$error":"#N/A"}]
["Preston 007",78.509439999999998,76.747649999999993,80.271230000000003,"NoDiff",{"$f":"IF(ISNA(VLOOKUP(A49,'MSOA figures'!$B$1:$L$309,11,FALSE)),\"\",VLOOKUP(A49,'MSOA figures'!$B$1:$L$309,11,FALSE))","v":1},null,1.7617900000000049,1.7617900000000049,null,{"$error":"#N/A"},78.509439999999998,{"$error":"#N/A"}]
["Preston 008",80.034239999999997,78.342510000000004,81.725980000000007,"NoDiff",{"$f":"IF(ISNA(VLOOKUP(A50,'MSOA figures'!$B$1:$L$309,11,FALSE)),\"\",VLOOKUP(A50,'MSOA figures'!$B$1:$L$309,11,FALSE))","v":4},null,1.6917299999999926,1.69174000000001,null,{"$error":"#N/A"},80.034239999999997,{"$error":"#N/A"}]
["Preston 009",72.946349999999995,71.232600000000005,74.660089999999997,"Worse",{"$f":"IF(ISNA(VLOOKUP(A51,'MSOA figures'!$B$1:$L$309,11,FALSE)),\"\",VLOOKUP(A51,'MSOA figures'!$B$1:$L$309,11,FALSE))","v":1},null,1.7137499999999903,1.7137400000000014,null,{"$error":"#N/A"},{"$error":"#N/A"},72.946349999999995]
["Preston 010",76.508129999999994,74.169449999999998,78.846800000000002,"Worse",{"$f":"IF(ISNA(VLOOKUP(A52,'MSOA figures'!$B$1:$L$309,11,FALSE)),\"\",VLOOKUP(A52,'MSOA figures'!$B$1:$L$309,11,FALSE))","v":4},null,2.3386799999999965,2.3386700000000076,null,{"$error":"#N/A"},{"$error":"#N/A"},76.508129999999994]
["Preston 011",74.701480000000004,72.507260000000002,76.895700000000005,"Worse",{"$f":"IF(ISNA(VLOOKUP(A53,'MSOA figures'!$B$1:$L$309,11,FALSE)),\"\",VLOOKUP(A53,'MSOA figures'!$B$1:$L$309,11,FALSE))","v":1},null,2.1942200000000014,2.1942200000000014,null,{"$error":"#N/A"},{"$error":"#N/A"},74.701480000000004]
["Preston 012",77.338329999999999,75.508409999999998,79.16825,"Worse",{"$f":"IF(ISNA(VLOOKUP(A54,'MSOA figures'!$B$1:$L$309,11,FALSE)),\"\",VLOOKUP(A54,'MSOA figures'!$B$1:$L$309,11,FALSE))","v":2},null,1.8299200000000013,1.8299200000000013,null,{"$error":"#N/A"},{"$error":"#N/A"},77.338329999999999]
["Preston 013",76.418589999999995,74.634320000000002,78.202870000000004,"Worse",{"$f":"IF(ISNA(VLOOKUP(A55,'MSOA figures'!$B$1:$L$309,11,FALSE)),\"\",VLOOKUP(A55,'MSOA figures'!$B$1:$L$309,11,FALSE))","v":2},null,1.7842699999999923,1.7842800000000096,null,{"$error":"#N/A"},{"$error":"#N/A"},76.418589999999995]
["Preston 014",72.911959999999993,70.902360000000002,74.921549999999996,"Worse",{"$f":"IF(ISNA(VLOOKUP(A56,'MSOA figures'!$B$1:$L$309,11,FALSE)),\"\",VLOOKUP(A56,'MSOA figures'!$B$1:$L$309,11,FALSE))","v":1},null,2.0095999999999918,2.0095900000000029,null,{"$error":"#N/A"},{"$error":"#N/A"},72.911959999999993]
["Preston 015",76.632159999999999,73.922910000000002,79.341409999999996,"Worse",{"$f":"IF(ISNA(VLOOKUP(A57,'MSOA figures'!$B$1:$L$309,11,FALSE)),\"\",VLOOKUP(A57,'MSOA figures'!$B$1:$L$309,11,FALSE))","v":1},null,2.7092499999999973,2.7092499999999973,null,{"$error":"#N/A"},{"$error":"#N/A"},76.632159999999999]
["Preston 016",77.051190000000005,75.002650000000003,79.099729999999994,"Worse",{"$f":"IF(ISNA(VLOOKUP(A58,'MSOA figures'!$B$1:$L$309,11,FALSE)),\"\",VLOOKUP(A58,'MSOA figures'!$B$1:$L$309,11,FALSE))","v":1},null,2.0485400000000027,2.0485399999999885,null,{"$error":"#N/A"},{"$error":"#N/A"},77.051190000000005]
["Preston 017",74.007320000000007,71.899420000000006,76.115219999999994,"Worse",{"$f":"IF(ISNA(VLOOKUP(A59,'MSOA figures'!$B$1:$L$309,11,FALSE)),\"\",VLOOKUP(A59,'MSOA figures'!$B$1:$L$309,11,FALSE))","v":1},null,2.1079000000000008,2.1078999999999866,null,{"$error":"#N/A"},{"$error":"#N/A"},74.007320000000007]
[null,null,null,null,null,{"$f":"IF(ISNA(VLOOKUP(A60,'MSOA figures'!$B$1:$L$309,11,FALSE)),\"\",VLOOKUP(A60,'MSOA figures'!$B$1:$L$309,11,FALSE))","v":""},null,0,0,null,{"$error":"#N/A"},{"$error":"#N/A"},{"$error":"#N/A"}]
[]
[]
[]
["MSOA life expectancy maps are available on Public Health England : Local Tool   - www.localhealth.org.uk"]

{"sheet":"Healthy Life Expectancy","index":4,"n_rows":59,"n_cols":16,"rows_kept":59,"cut":false,"hidden":false,"merged":[[0,0,2,13],[4,0,8,14]]}
["Upper tier local authority estimated healthy life expectancy at birth 2012-2014"]
[]
[]
[]
["The statistical bulletin includes notes on the definition of health expectancies and details of the data and methods used in calculating these estimates. Briefly, HLE estimates were calculated by combining the prevalence of \"Good\" general health across the upper tier local authorities and English regions with mortality data and mid-year population estimates (MYPE) in the period  2012 to 2014. The health prevalence data used in calculating HLE estimates for the various geographies in England were derived from the Annual Population Survey (APS)."]
[]
[]
[]
[]
["The statistical bulletin which accompanies the publication of these estimates can be found on the Office for National Statistics website at:"]
["http://www.ons.gov.uk/peoplepopulationandcommunity/healthandsocialcare/healthandlifeexpectancies"]
[]
["Male"]
[]
["Local authority code","Local authority name","English region","LE (years)","HLE (years)","Significance","Lower 95% confidence interval","Upper 95% confidence interval","Proportion of life spent in \"Good\" health (%)","LE rank out of 150","HLE rank out of 150","Year","England","Lower 95% confidence interval","Upper 95% confidence interval"]
["E10000017","Lancashire","North West",78.485129999999998,61.139220000000002,"Significantly lower than England",59.87764,62.400790000000001,77.899100000000004,98,98,"2012-14",63.4,63.257750000000001,63.59554,{"$f":"IF(N16>H16,\"Significantly below England value\",IF(O16<G16,\"Significantly above England value\",\"No significant difference from England value\"))","v":"Significantly below England value"}]
["E10000017","Lancashire","North West",78.260199999999998,61.325389999999999,"Significantly lower than England",60.110390000000002,62.540390000000002,78.360900000000001,98,95,"2011-13",63.271270000000001,63.102110000000003,63.440420000000003,{"$f":"IF(N17>H17,\"Significantly below England value\",IF(O17<G17,\"Significantly above England value\",\"No significant difference from England value\"))","v":"Significantly below England value"}]
["E10000017","Lancashire","North West",78.155799999999999,62.69999,"-",61.537489999999998,63.862490000000001,80.224360000000004,100,77,"2010-12",63.363129999999998,63.200479999999999,63.525779999999997,"No significant difference from England value"]
["E10000017","Lancashire","North West",77.816909999999993,62.81861,"-",61.658360000000002,63.978850000000001,80.726159999999993,99,71,"2009-11",63.223709999999997,63.066490000000002,63.380940000000002,"No significant difference from England value"]
[]
[]
[null,"2009-11","2010-12","2011-13","2012-14"]
["England",63.2,63.4,63.3,63.4]
["Lancashire",62.8,62.7,61.3,61.1]
[]
[]
[]
[]
[]
[]
[]
[]
[]
[]
[]
[]
[]
[]
[]
[]
[]
[]
[]
[]
[]
[]
[]
["Female"]
[]
["Local authority code","Local authority name","English region","LE (years)","HLE (years)","Significance","Lower 95% confidence interval","Upper 95% confidence interval","Proportion of life spent in \"Good\" health (%)","LE rank out of 150","HLE rank out of 150","Year","England","Lower 95% confidence interval","Upper 95% confidence interval"]
["E10000017","Lancashire","North West",82.128619999999998,63.0627,"-",61.782049999999998,64.343339999999998,76.785290000000003,115,76,"2012-14",64.003690000000006,63.818939999999998,64.18844,{"$f":"IF(N51>H51,\"Significantly below England value\",IF(O51<G51,\"Significantly above England value\",\"No significant difference from England value\"))","v":"No significant difference from England value"}]
["E10000017","Lancashire","North West",81.973320000000001,62.40681,"Significantly lower than England",61.1081,63.705530000000003,76.13064,116,92,"2011-13",63.947740000000003,63.765799999999999,64.129679999999993,{"$f":"IF(N52>H52,\"Significantly below England value\",IF(O52<G52,\"Significantly above England value\",\"No significant difference from England value\"))","v":"Significantly below England value"}]
["E10000017","Lancashire","North West",81.978999999999999,62.218629999999997,"Significantly lower than England",60.87717,63.560079999999999,75.895809999999997,113,92,"2010-12",64.101219999999998,63.924790000000002,64.277640000000005,"Significantly below England value"]
["E10000017","Lancashire","North West",81.750110000000006,63.266599999999997,"-",62.006770000000003,64.526420000000002,77.390230000000003,117,74,"2009-11",64.151110000000003,63.981610000000003,64.320610000000002,"No significant difference from England value"]
[]
[]
[null,"2009-11","2010-12","2011-13","2012-14"]
["England",{"$f":"N54","v":63.981610000000003},{"$f":"N53","v":63.924790000000002},{"$f":"N52","v":63.765799999999999},{"$f":"N51","v":63.818939999999998}]
["Lancashire",{"$f":"E54","v":63.266599999999997},{"$f":"E53","v":62.218629999999997},{"$f":"E52","v":62.40681},{"$f":"E51","v":63.0627}]

{"sheet":"LE v HLE","index":5,"n_rows":42,"n_cols":6,"rows_kept":42,"cut":false,"hidden":false,"merged":[[4,0,6,13],[0,0,2,15]]}
["Upper tier local authority estimated life expectancy Vs healthy life expectancy at birth 2012-2014"]
[]
[]
[]
["The charts on this page show how life expectancy and health life expectancy at birth for the Lancashire county has changed 2009-11 to 2012-14.  Showing that whilst male life expectancy has gradually increased, male healthy life expectancy has decreased.  The figures for females are more positive in that they are showing an increase when compared to the past two publications."]
[]
[]
["Males"]
[null,null,"2009-11","2010-12","2011-13","2012-14"]
[null,"Life expectancy",77.816909999999993,78.155799999999999,78.260199999999998,78.485129999999998]
[null,"Healthy life expectancy",62.8,62.7,61.3,61.1]
[]
[]
[]
[]
[]
[]
[]
[]
[]
[]
[]
[]
[]
[]
[]
[]
[]
[]
[]
[]
[]
[]
[]
[]
[]
[]
["Females"]
[]
[null,null,"2009-11","2010-12","2011-13","2012-14"]
[null,"Life expectancy",81.750110000000006,81.978999999999999,81.973320000000001,82.128619999999998]
[null,"Healthy life expectancy",63.266599999999997,62.218629999999997,62.40681,63.0627]

{"sheet":"Lookups","index":6,"n_rows":21,"n_cols":1,"rows_kept":21,"cut":false,"hidden":true,"merged":[]}
[]
[]
[]
[]
["Female"]
["Male"]
[]
[]
[]
["Burnley"]
["Chorley"]
["Fylde"]
["Hyndburn"]
["Lancaster"]
["Pendle"]
["Preston"]
["Ribble Valley"]
["Rossendale"]
["South Ribble"]
["West Lancashire"]
["Wyre"]

{"sheet":"MSOA figures","index":7,"n_rows":309,"n_cols":12,"rows_kept":309,"cut":false,"hidden":true,"merged":[]}
["MSOA Codes","MSOA Names","LA","Gender","LE","Significance","Lower CI","Upper CI","IMD 2015 Scores","National LE rank","National % rank","IMD Quintile|2015 (1 = most deprived, 5 = least)"]
["E02005245","Pendle 006","Pendle","Male",84.308109999999999,"Better",82.379549999999995,86.236670000000004,12.2008975869003,191,{"$f":"PERCENTRANK($E$2:$E$155,E2)","v":1},4]
["E02005302","South Ribble 016","South Ribble","Male",84.062479999999994,"Better",81.970349999999996,86.154610000000005,10.084283297491,239,0.99299999999999999,4]
["E02005296","South Ribble 010","South Ribble","Male",83.403440000000003,"Better",81.236739999999998,85.570149999999998,6.3230034328870603,430,0.98599999999999999,5]
["E02005273","Ribble Valley 004","Ribble Valley","Male",82.852810000000005,"Better",80.980720000000005,84.724890000000002,8.2833853037343008,648,0.98,5]
["E02005288","South Ribble 002","South Ribble","Male",82.689049999999995,"Better",80.529120000000006,84.848990000000001,11.0084709495352,725,0.97299999999999998,4]
["E02005254","Preston 002","Preston","Male",82.564319999999995,"Better",80.319640000000007,84.809010000000001,7.4025563744707501,790,0.96699999999999997,5]
["E02005277","Ribble Valley 008","Ribble Valley","Male",82.476089999999999,"Better",81.346040000000002,83.606139999999996,5.6751561554833696,842,0.96,5]
["E02005330","Wyre 012","Wyre","Male",82.358329999999995,"Better",80.717039999999997,83.999619999999993,8.5120789950203708,909,0.95399999999999996,5]
["E02005184","Burnley 009","Burnley","Male",82.338250000000002,"Better",80.263499999999993,84.412999999999997,12.631066077525601,919,0.94699999999999995,4]
["E02005255","Preston 003","Preston","Male",82.330740000000006,"Better",80.823239999999998,83.838239999999999,7.0180688958707398,927,0.94099999999999995,5]
["E02005304","West Lancashire 001","West Lancashire","Male",82.083219999999997,"Better",80.683000000000007,83.483440000000002,8.34709205755059,1092,0.93400000000000005,5]
["E02005290","South Ribble 004","South Ribble","Male",82.005319999999998,"Better",80.148849999999996,83.861789999999999,7.8187685848017603,1143,0.92800000000000005,5]
["E02005332","Wyre 014","Wyre","Male",82.000529999999998,"Better",80.039659999999998,83.961399999999998,8.2813519704433496,1149,0.92100000000000004,5]
["E02005289","South Ribble 003","South Ribble","Male",81.868840000000006,"Better",79.964370000000002,83.773309999999995,4.9902624412384498,1230,0.91500000000000004,5]
["E02005222","Lancaster 002","Lancaster","Male",81.851979999999998,"Better",79.980940000000004,83.723020000000005,13.8224390203266,1248,0.90800000000000003,4]
["E02005210","Fylde 008","Fylde","Male",81.77,"Better",80.59845,82.941559999999996,10.798035599022,1312,0.90100000000000002,4]
["E02005324","Wyre 006","Wyre","Male",81.710350000000005,"Better",79.968360000000004,83.452330000000003,10.7893199040767,1360,0.89500000000000002,4]
["E02005311","West Lancashire 008","West Lancashire","Male",81.657269999999997,"Better",79.238,84.076549999999997,12.215952389287599,1401,0.88800000000000001,4]
["E02005312","West Lancashire 009","West Lancashire","Male",81.567710000000005,"Better",78.799250000000001,84.336160000000007,16.258921164651799,1474,0.88200000000000001,3]
["E02005195","Chorley 007","Chorley","Male",81.38458,"Better",79.693979999999996,83.075190000000006,11.6649363500746,1619,0.875,4]
["E02005241","Pendle 002","Pendle","Male",81.209609999999998,"Better",78.812569999999994,83.606660000000005,21.314398401420998,1762,0.86899999999999999,3]
["E02005199","Chorley 011","Chorley","Male",81.192300000000003,"Better",79.109719999999996,83.274879999999996,7.43585365513393,1773,0.86199999999999999,5]
["E02005297","South Ribble 011","South Ribble","Male",81.068290000000005,"Better",79.407470000000004,82.729110000000006,6.5980482596889702,1869,0.85599999999999998,5]
["E02005274","Ribble Valley 005","Ribble Valley","Male",80.953999999999994,"Better",78.960260000000005,82.947749999999999,7.0688741050119299,1970,0.84899999999999998,5]
["E02005270","Ribble Valley 001","Ribble Valley","Male",80.936589999999995,"Better",79.380089999999996,82.493089999999995,14.148941813261199,1983,0.84299999999999997,4]
["E02005315","West Lancashire 012","West Lancashire","Male",80.933700000000002,"Better",79.32405,82.543350000000004,7.5284166666666703,1985,0.83599999999999997,5]
["E02005239","Lancaster 019","Lancaster","Male",80.917630000000003,"Better",79.314440000000005,82.520830000000004,10.722785437057,1999,0.83,4]
["E02005287","South Ribble 001","South Ribble","Male",80.619919999999993,"NoDiff",78.401250000000005,82.838589999999996,4.0338890332158099,2287,0.82299999999999995,5]
["E02005206","Fylde 004","Fylde","Male",80.555679999999995,"NoDiff",78.642330000000001,82.46902,19.866991875816002,2352,0.81599999999999995,3]
["E02005310","West Lancashire 007","West Lancashire","Male",80.546340000000001,"NoDiff",78.358980000000003,82.733710000000002,12.5222993213766,2361,0.81,4]
["E02005328","Wyre 010","Wyre","Male",80.474819999999994,"NoDiff",78.522319999999993,82.427319999999995,10.816095539684699,2432,0.80300000000000005,4]
["E02005253","Preston 001","Preston","Male",80.464730000000003,"NoDiff",78.668319999999994,82.261129999999994,12.963947350485601,2442,0.79700000000000004,4]
["E02005221","Lancaster 001","Lancaster","Male",80.461860000000001,"Better",78.993099999999998,81.930620000000005,13.848112081952401,2444,0.79,4]
["E02005223","Lancaster 003","Lancaster","Male",80.454740000000001,"NoDiff",78.612319999999997,82.297169999999994,8.4579873120948807,2450,0.78400000000000003,5]
["E02005285","Rossendale 008","Rossendale","Male",80.395079999999993,"NoDiff",78.896180000000001,81.893990000000002,11.267816722301699,2520,0.77700000000000002,4]
["E02005247","Pendle 008","Pendle","Male",80.334789999999998,"NoDiff",78.758740000000003,81.910830000000004,9.9564119490497394,2577,0.77100000000000002,5]
["E02005205","Fylde 003","Fylde","Male",80.265219999999999,"NoDiff",78.477549999999994,82.052890000000005,12.3559694023904,2643,0.76400000000000001,4]
["E02005202","Chorley 014","Chorley","Male",80.255769999999998,"NoDiff",78.249499999999998,82.262039999999999,12.3426453767481,2651,0.75800000000000001,4]
["E02005192","Chorley 004","Chorley","Male",80.250860000000003,"NoDiff",78.490399999999994,82.011330000000001,9.0612959223300997,2659,0.751,5]
["E02005325","Wyre 007","Wyre","Male",80.200789999999998,"NoDiff",78.487350000000006,81.914230000000003,10.0994689303151,2703,0.745,4]
["E02005196","Chorley 008","Chorley","Male",80.041709999999995,"NoDiff",78.283580000000001,81.79983,14.293263757115801,2847,0.73799999999999999,4]
["E02005260","Preston 008","Preston","Male",80.034239999999997,"NoDiff",78.342510000000004,81.725980000000007,12.6071108670182,2852,0.73199999999999998,4]
["E02005295","South Ribble 009","South Ribble","Male",80.012619999999998,"NoDiff",78.316209999999998,81.709019999999995,13.296977100271,2872,0.72499999999999998,4]
["E02005225","Lancaster 005","Lancaster","Male",79.968170000000001,"NoDiff",77.184309999999996,82.752020000000002,10.4246475363413,2913,0.71799999999999997,4]
["E02005306","West Lancashire 003","West Lancashire","Male",79.952590000000001,"NoDiff",78.214429999999993,81.690759999999997,18.291209466122002,2935,0.71199999999999997,3]
["E02005211","Fylde 009","Fylde","Male",79.943700000000007,"NoDiff",78.340479999999999,81.546909999999997,9.41611265808098,2948,0.70499999999999996,5]
["E02005258","Preston 006","Preston","Male",79.938689999999994,"NoDiff",78.514200000000002,81.363190000000003,13.299243102162601,2954,0.69899999999999995,4]
["E02005291","South Ribble 005","South Ribble","Male",79.927840000000003,"NoDiff",78.118840000000006,81.736840000000001,13.145957708779401,2967,0.69199999999999995,4]
["E02005309","West Lancashire 006","West Lancashire","Male",79.900310000000005,"NoDiff",78.235870000000006,81.564760000000007,10.7652354831033,3000,0.68600000000000005,4]
["E02005191","Chorley 003","Chorley","Male",79.751919999999998,"NoDiff",77.859889999999993,81.643950000000004,10.645991926738199,3140,0.67900000000000005,4]
["E02005318","West Lancashire 015","West Lancashire","Male",79.740110000000001,"NoDiff",77.989019999999996,81.491200000000006,14.5920725331874,3152,0.67300000000000004,4]
["E02005307","West Lancashire 004","West Lancashire","Male",79.625749999999996,"NoDiff",78.069010000000006,81.182490000000001,13.426342627753099,3259,0.66600000000000004,4]
["E02005250","Pendle 011","Pendle","Male",79.592939999999999,"NoDiff",77.196929999999995,81.988939999999999,40.494398893748397,3291,0.66,1]
["E02006871","Lancaster 020","Lancaster","Male",79.470460000000003,"NoDiff",77.949259999999995,80.991669999999999,21.535563094536599,3390,0.65300000000000002,3]
["E02005186","Burnley 011","Burnley","Male",79.355069999999998,"NoDiff",77.195449999999994,81.514679999999998,17.564248715824402,3503,0.64700000000000002,3]
["E02005242","Pendle 003","Pendle","Male",79.332390000000004,"NoDiff",76.980800000000002,81.683989999999994,17.065144397939498,3532,0.64,3]
["E02005240","Pendle 001","Pendle","Male",79.325159999999997,"NoDiff",76.893159999999995,81.757149999999996,19.590041897379098,3540,0.63300000000000001,3]
["E02005190","Chorley 002","Chorley","Male",79.317369999999997,"NoDiff",77.525109999999998,81.109629999999996,10.9036474750724,3551,0.627,4]
["E02005276","Ribble Valley 007","Ribble Valley","Male",79.303370000000001,"NoDiff",77.322929999999999,81.283820000000006,10.355099488278,3565,0.62,4]
["E02005305","West Lancashire 002","West Lancashire","Male",79.299679999999995,"NoDiff",77.348150000000004,81.251220000000004,17.342583240843499,3569,0.61399999999999999,3]
["E02005193","Chorley 005","Chorley","Male",79.28537,"NoDiff",77.482129999999998,81.088610000000003,8.2881943420896196,3581,0.60699999999999998,5]
["E02005203","Fylde 001","Fylde","Male",79.180700000000002,"NoDiff",77.020359999999997,81.341030000000003,13.129877813060901,3660,0.60099999999999998,4]
["E02005308","West Lancashire 005","West Lancashire","Male",79.094679999999997,"NoDiff",76.999110000000002,81.190250000000006,7.4957936794582398,3719,0.59399999999999997,5]
["E02005298","South Ribble 012","South Ribble","Male",79.034959999999998,"NoDiff",76.743129999999994,81.326779999999999,11.970740885054299,3775,0.58799999999999997,4]
["E02005235","Lancaster 015","Lancaster","Male",78.98554,"NoDiff",76.20478,81.766300000000001,14.5971932743363,3828,{"$f":"PERCENTRANK($E$2:$E$155,E66)","v":0.58099999999999996},4]
["E02005194","Chorley 006","Chorley","Male",78.923180000000002,"NoDiff",76.849450000000004,80.996899999999997,23.679056768559001,3889,0.57499999999999996,2]
["E02005272","Ribble Valley 003","Ribble Valley","Male",78.880399999999995,"NoDiff",77.293980000000005,80.466819999999998,17.6451197116039,3931,0.56799999999999995,3]
["E02005209","Fylde 007","Fylde","Male",78.834680000000006,"NoDiff",76.931100000000001,80.73827,11.7933053543714,3958,0.56200000000000006,4]
["E02005220","Hyndburn 009","Hyndburn","Male",78.804320000000004,"NoDiff",76.823300000000003,80.785340000000005,17.475987313312999,3978,0.55500000000000005,3]
["E02005271","Ribble Valley 002","Ribble Valley","Male",78.77516,"NoDiff",76.828940000000003,80.721379999999996,9.4090805253382896,4003,0.54900000000000004,5]
["E02005212","Hyndburn 001","Hyndburn","Male",78.730080000000001,"NoDiff",77.049139999999994,80.411019999999994,26.0977321610366,4038,0.54200000000000004,2]
["E02005301","South Ribble 015","South Ribble","Male",78.608900000000006,"NoDiff",76.302710000000005,80.915099999999995,23.927578536889701,4134,0.53500000000000003,2]
["E02005299","South Ribble 013","South Ribble","Male",78.572000000000003,"NoDiff",76.548169999999999,80.595820000000003,17.404598467223199,4166,0.52900000000000003,3]
["E02005198","Chorley 010","Chorley","Male",78.547579999999996,"NoDiff",76.542519999999996,80.552639999999997,25.853659296718799,4192,0.52200000000000002,2]
["E02005292","South Ribble 006","South Ribble","Male",78.530420000000007,"NoDiff",75.978470000000002,81.082359999999994,21.205032642487001,4205,0.51600000000000001,3]
["E02005294","South Ribble 008","South Ribble","Male",78.527469999999994,"NoDiff",76.359769999999997,80.695170000000005,18.2440584914537,4209,0.50900000000000001,3]
["E02005259","Preston 007","Preston","Male",78.509439999999998,"NoDiff",76.747649999999993,80.271230000000003,32.769606140608197,4228,0.503,1]
["E02005207","Fylde 005","Fylde","Male",78.340159999999997,"NoDiff",75.862089999999995,80.818219999999997,12.708819442724501,4357,0.496,4]
["E02005300","South Ribble 014","South Ribble","Male",78.339179999999999,"NoDiff",76.331180000000003,80.347179999999994,13.8580818094321,4358,0.49,4]
["E02005176","Burnley 001","Burnley","Male",78.299679999999995,"NoDiff",76.785929999999993,79.81344,19.819664697193499,4390,0.48299999999999998,3]
["E02005331","Wyre 013","Wyre","Male",78.211979999999997,"NoDiff",76.123999999999995,80.299949999999995,13.2903261969638,4444,0.47699999999999998,4]
["E02005281","Rossendale 004","Rossendale","Male",78.196799999999996,"NoDiff",76.462860000000006,79.93074,24.9718167589694,4462,0.47,2]
["E02005204","Fylde 002","Fylde","Male",78.149339999999995,"NoDiff",76.615660000000005,79.683019999999999,12.865544711538501,4495,0.46400000000000002,4]
["E02005329","Wyre 011","Wyre","Male",78.007199999999997,"NoDiff",76.252949999999998,79.761439999999993,19.1497777904328,4597,0.45700000000000002,3]
["E02005201","Chorley 013","Chorley","Male",77.976789999999994,"NoDiff",76.305059999999997,79.648529999999994,18.811322944048101,4626,0.45,3]
["E02005236","Lancaster 016","Lancaster","Male",77.943899999999999,"NoDiff",76.473849999999999,79.41395,22.9657086959871,4643,0.44400000000000001,2]
["E02005238","Lancaster 018","Lancaster","Male",77.741799999999998,"NoDiff",75.404700000000005,80.078909999999993,15.236604520764001,4778,0.437,3]
["E02005180","Burnley 005","Burnley","Male",77.728080000000006,"NoDiff",75.569339999999997,79.886809999999997,16.294016374605,4789,0.43099999999999999,3]
["E02005327","Wyre 009","Wyre","Male",77.629850000000005,"NoDiff",75.254230000000007,80.005459999999999,13.688955304435799,4849,0.42399999999999999,4]
["E02005275","Ribble Valley 006","Ribble Valley","Male",77.543970000000002,"NoDiff",75.297780000000003,79.79016,8.8168366228070205,4908,0.41799999999999998,5]
["E02005293","South Ribble 007","South Ribble","Male",77.537450000000007,"Worse",75.878860000000003,79.19605,18.438456552706601,4913,0.41099999999999998,3]
["E02005322","Wyre 004","Wyre","Male",77.474720000000005,"Worse",75.774420000000006,79.175020000000004,15.660088918046,4945,0.40500000000000003,3]
["E02005237","Lancaster 017","Lancaster","Male",77.446889999999996,"Worse",75.833839999999995,79.059939999999997,16.195255607193399,4960,0.39800000000000002,3]
["E02005214","Hyndburn 003","Hyndburn","Male",77.364739999999998,"Worse",75.323660000000004,79.405820000000006,27.513310519062902,5011,0.39200000000000002,2]
["E02005264","Preston 012","Preston","Male",77.338329999999999,"Worse",75.508409999999998,79.16825,26.747991424220601,5032,0.38500000000000001,2]
["E02005234","Lancaster 014","Lancaster","Male",77.337059999999994,"NoDiff",75.090379999999996,79.583740000000006,24.4735193995675,5036,0.379,2]
["E02005326","Wyre 008","Wyre","Male",77.288659999999993,"Worse",75.615359999999995,78.961950000000002,26.462692595625199,5073,0.372,2]
["E02005284","Rossendale 007","Rossendale","Male",77.197770000000006,"Worse",75.436620000000005,78.958920000000006,11.883455561285899,5124,0.36599999999999999,4]
["E02005286","Rossendale 009","Rossendale","Male",77.174430000000001,"Worse",75.16319,79.185670000000002,22.248180430164599,5138,0.35899999999999999,2]
["E02005213","Hyndburn 002","Hyndburn","Male",77.103729999999999,"Worse",75.606920000000002,78.600530000000006,24.302401128472201,5186,0.35199999999999998,2]
["E02005233","Lancaster 013","Lancaster","Male",77.086699999999993,"Worse",75.216430000000003,78.956959999999995,23.8869621056241,5197,0.34599999999999997,2]
["E02005268","Preston 016","Preston","Male",77.051190000000005,"Worse",75.002650000000003,79.099729999999994,36.979018591729897,5217,0.33900000000000002,1]
["E02005323","Wyre 005","Wyre","Male",77.008340000000004,"Worse",74.92577,79.090909999999994,32.615708086214397,5239,0.33300000000000002,1]
["E02005256","Preston 004","Preston","Male",76.902460000000005,"Worse",75.061300000000003,78.743629999999996,8.6745425638100695,5287,0.32600000000000001,5]
["E02005224","Lancaster 004","Lancaster","Male",76.891390000000001,"Worse",74.55959,79.223200000000006,18.271609230769201,5292,0.32,3]
["E02005246","Pendle 007","Pendle","Male",76.882540000000006,"Worse",74.379050000000007,79.386030000000005,43.5376888626989,5296,0.313,1]
["E02005228","Lancaster 008","Lancaster","Male",76.86918,"Worse",74.685609999999997,79.052750000000003,29.9261722289469,5305,0.307,2]
["E02005251","Pendle 012","Pendle","Male",76.728380000000001,"Worse",74.463149999999999,78.993600000000001,24.6608576579175,5378,0.3,2]
["E02005267","Preston 015","Preston","Male",76.632159999999999,"Worse",73.922910000000002,79.341409999999996,41.057928929519299,5427,0.29399999999999998,1]
["E02005280","Rossendale 003","Rossendale","Male",76.56617,"Worse",74.816980000000001,78.315359999999998,31.522135249950601,5458,0.28699999999999998,2]
["E02005262","Preston 010","Preston","Male",76.508129999999994,"Worse",74.169449999999998,78.846800000000002,12.2473856240894,5492,0.28100000000000003,4]
["E02005320","Wyre 002","Wyre","Male",76.498230000000007,"Worse",74.394069999999999,78.60239,24.302705270339398,5498,0.27400000000000002,2]
["E02006884","Rossendale 010","Rossendale","Male",76.428640000000001,"Worse",74.675700000000006,78.181579999999997,30.470925213675201,5533,0.26700000000000002,2]
["E02005265","Preston 013","Preston","Male",76.418589999999995,"Worse",74.634320000000002,78.202870000000004,25.303259384728101,5541,0.26100000000000001,2]
["E02005244","Pendle 005","Pendle","Male",76.361859999999993,"Worse",74.339920000000006,78.383809999999997,31.047051286391302,5570,0.254,2]
["E02005278","Rossendale 001","Rossendale","Male",76.312860000000001,"Worse",74.543999999999997,78.081720000000004,12.4134878923767,5601,0.248,4]
["E02005279","Rossendale 002","Rossendale","Male",76.286590000000004,"Worse",74.565929999999994,78.007239999999996,27.2455664891041,5617,0.24099999999999999,2]
["E02005208","Fylde 006","Fylde","Male",76.174300000000002,"Worse",74.424170000000004,77.924430000000001,25.663278213639099,5680,0.23499999999999999,2]
["E02005219","Hyndburn 008","Hyndburn","Male",76.121669999999995,"Worse",74.161659999999998,78.081680000000006,24.308666785969901,5716,0.22800000000000001,2]
["E02005179","Burnley 004","Burnley","Male",76.112690000000001,"Worse",74.327759999999998,77.897620000000003,35.513788063063103,5719,0.222,1]
["E02005252","Pendle 013","Pendle","Male",76.080089999999998,"Worse",74.071560000000005,78.088620000000006,31.9358210311152,5733,0.215,2]
["E02005200","Chorley 012","Chorley","Male",75.989419999999996,"Worse",74.268090000000001,77.710759999999993,27.5990711192159,5773,0.20899999999999999,2]
["E02005243","Pendle 004","Pendle","Male",75.772360000000006,"Worse",73.509370000000004,78.035340000000005,35.656894642143101,5887,0.20200000000000001,1]
["E02005189","Chorley 001","Chorley","Male",75.533969999999997,"Worse",73.911180000000002,77.156769999999995,34.781399962880499,6011,0.19600000000000001,1]
["E02005197","Chorley 009","Chorley","Male",75.512879999999996,"Worse",73.407660000000007,77.618099999999998,31.591734778268901,6014,0.189,2]
["E02005257","Preston 005","Preston","Male",75.316010000000006,"Worse",73.446849999999998,77.185180000000003,35.630125623130603,6068,0.183,1]
["E02005303","South Ribble 017","South Ribble","Male",75.130619999999993,"Worse",72.726150000000004,77.535079999999994,32.054320956576497,6143,0.17599999999999999,2]
["E02005249","Pendle 010","Pendle","Male",74.98527,"Worse",73.129959999999997,76.840580000000003,47.855461701003698,6192,0.16900000000000001,1]
["E02005230","Lancaster 010","Lancaster","Male",74.983159999999998,"Worse",72.528729999999996,77.437600000000003,38.511172877214399,6193,{"$f":"PERCENTRANK($E$2:$E$155,E130)","v":0.16300000000000001},1]
["E02005321","Wyre 003","Wyre","Male",74.981290000000001,"Worse",72.095770000000002,77.866810000000001,33.7100836852808,6194,0.156,1]
["E02005218","Hyndburn 007","Hyndburn","Male",74.978449999999995,"Worse",72.892189999999999,77.064710000000005,29.849492922008501,6195,0.15,2]
["E02006881","Burnley 014","Burnley","Male",74.859440000000006,"Worse",73.082610000000003,76.636259999999993,34.900270427625003,6232,0.14299999999999999,1]
["E02005181","Burnley 006","Burnley","Male",74.859009999999998,"Worse",72.531890000000004,77.186139999999995,36.820134277894098,6234,0.13700000000000001,1]
["E02005317","West Lancashire 014","West Lancashire","Male",74.841399999999993,"Worse",72.758319999999998,76.924490000000006,53.235831657935698,6239,0.13,1]
["E02005231","Lancaster 011","Lancaster","Male",74.711299999999994,"Worse",72.765659999999997,76.656940000000006,39.335361083374899,6280,0.124,1]
["E02005263","Preston 011","Preston","Male",74.701480000000004,"Worse",72.507260000000002,76.895700000000005,33.761161335578002,6285,0.11700000000000001,1]
["E02005183","Burnley 008","Burnley","Male",74.242369999999994,"Worse",71.788889999999995,76.695849999999993,30.254454425363299,6430,0.111,2]
["E02005215","Hyndburn 004","Hyndburn","Male",74.218270000000004,"Worse",72.499399999999994,75.937129999999996,34.640656410688699,6432,0.104,1]
["E02005316","West Lancashire 013","West Lancashire","Male",74.085260000000005,"Worse",71.919690000000003,76.250820000000004,42.318940476190498,6466,9.8000000000000004E-2,1]
["E02005269","Preston 017","Preston","Male",74.007320000000007,"Worse",71.899420000000006,76.115219999999994,37.784017138302097,6488,9.0999999999999998E-2,1]
["E02005319","Wyre 001","Wyre","Male",73.818029999999993,"Worse",71.92013,75.71593,48.033303547482603,6518,8.4000000000000005E-2,1]
["E02005216","Hyndburn 005","Hyndburn","Male",73.729680000000002,"Worse",71.425409999999999,76.033950000000004,40.079323177570103,6530,7.8E-2,1]
["E02005217","Hyndburn 006","Hyndburn","Male",73.72578,"Worse",71.983630000000005,75.467920000000007,55.820550399201601,6532,7.0999999999999994E-2,1]
["E02005313","West Lancashire 010","West Lancashire","Male",73.654929999999993,"Worse",71.930940000000007,75.378910000000005,43.0669329737174,6544,6.5000000000000002E-2,1]
["E02005314","West Lancashire 011","West Lancashire","Male",73.595370000000003,"Worse",71.211969999999994,75.978769999999997,26.205373025704599,6550,5.8000000000000003E-2,2]
["E02005178","Burnley 003","Burnley","Male",73.525149999999996,"Worse",71.399730000000005,75.650559999999999,58.716808873720097,6563,5.1999999999999998E-2,1]
["E02005177","Burnley 002","Burnley","Male",73.040689999999998,"Worse",70.441940000000002,75.639439999999993,37.581845264792101,6607,4.4999999999999998E-2,1]
["E02005261","Preston 009","Preston","Male",72.946349999999995,"Worse",71.232600000000005,74.660089999999997,52.324787160833701,6615,3.9E-2,1]
["E02005266","Preston 014","Preston","Male",72.911959999999993,"Worse",70.902360000000002,74.921549999999996,49.693403234020899,6621,3.2000000000000001E-2,1]
["E02005185","Burnley 010","Burnley","Male",72.866780000000006,"Worse",71.092500000000001,74.641050000000007,64.437053687315597,6623,2.5999999999999999E-2,1]
["E02005248","Pendle 009","Pendle","Male",72.628469999999993,"Worse",70.087670000000003,75.169280000000001,51.442249578156201,6647,1.9E-2,1]
["E02005229","Lancaster 009","Lancaster","Male",71.938149999999993,"Worse",69.531189999999995,74.345119999999994,58.932956452750403,6702,1.2999999999999999E-2,1]
["E02005226","Lancaster 006","Lancaster","Male",71.30959,"Worse",69.358639999999994,73.260540000000006,50.502267621703901,6733,6.0000000000000001E-3,1]
["E02005182","Burnley 007","Burnley","Male",70.490009999999998,"Worse",67.870760000000004,73.109260000000006,52.996266394835203,6765,0,1]
["E02005245","Pendle 006","Pendle","Female",84.308109999999999,"Better",82.379549999999995,86.236670000000004,12.2008975869003,191,0.97199999999999998,4]
["E02005302","South Ribble 016","South Ribble","Female",84.062479999999994,"Better",81.970349999999996,86.154610000000005,10.084283297491,239,0.96399999999999997,4]
["E02005296","South Ribble 010","South Ribble","Female",83.403440000000003,"Better",81.236739999999998,85.570149999999998,6.3230034328870603,430,0.93600000000000005,5]
["E02005273","Ribble Valley 004","Ribble Valley","Female",82.852810000000005,"Better",80.980720000000005,84.724890000000002,8.2833853037343008,648,0.90400000000000003,5]
["E02005288","South Ribble 002","South Ribble","Female",82.689049999999995,"Better",80.529120000000006,84.848990000000001,11.0084709495352,725,0.89300000000000002,4]
["E02005254","Preston 002","Preston","Female",82.564319999999995,"Better",80.319640000000007,84.809010000000001,7.4025563744707501,790,0.88300000000000001,5]
["E02005277","Ribble Valley 008","Ribble Valley","Female",82.476089999999999,"Better",81.346040000000002,83.606139999999996,5.6751561554833696,842,0.876,5]
["E02005330","Wyre 012","Wyre","Female",82.358329999999995,"Better",80.717039999999997,83.999619999999993,8.5120789950203708,909,0.86599999999999999,5]
["E02005184","Burnley 009","Burnley","Female",82.338250000000002,"Better",80.263499999999993,84.412999999999997,12.631066077525601,919,0.86399999999999999,4]
["E02005255","Preston 003","Preston","Female",82.330740000000006,"Better",80.823239999999998,83.838239999999999,7.0180688958707398,927,0.86299999999999999,5]
["E02005304","West Lancashire 001","West Lancashire","Female",82.083219999999997,"Better",80.683000000000007,83.483440000000002,8.34709205755059,1092,0.83899999999999997,5]
["E02005290","South Ribble 004","South Ribble","Female",82.005319999999998,"Better",80.148849999999996,83.861789999999999,7.8187685848017603,1143,0.83099999999999996,5]
["E02005332","Wyre 014","Wyre","Female",82.000529999999998,"Better",80.039659999999998,83.961399999999998,8.2813519704433496,1149,0.83,5]
["E02005289","South Ribble 003","South Ribble","Female",81.868840000000006,"Better",79.964370000000002,83.773309999999995,4.9902624412384498,1230,0.81799999999999995,5]
["E02005222","Lancaster 002","Lancaster","Female",81.851979999999998,"Better",79.980940000000004,83.723020000000005,13.8224390203266,1248,0.81599999999999995,4]
["E02005210","Fylde 008","Fylde","Female",81.77,"Better",80.59845,82.941559999999996,10.798035599022,1312,0.80600000000000005,4]
["E02005324","Wyre 006","Wyre","Female",81.710350000000005,"Better",79.968360000000004,83.452330000000003,10.7893199040767,1360,0.79900000000000004,4]
["E02005311","West Lancashire 008","West Lancashire","Female",81.657269999999997,"Better",79.238,84.076549999999997,12.215952389287599,1401,0.79300000000000004,4]
["E02005312","West Lancashire 009","West Lancashire","Female",81.567710000000005,"Better",78.799250000000001,84.336160000000007,16.258921164651799,1474,0.78300000000000003,3]
["E02005195","Chorley 007","Chorley","Female",81.38458,"Better",79.693979999999996,83.075190000000006,11.6649363500746,1619,0.76100000000000001,4]
["E02005241","Pendle 002","Pendle","Female",81.209609999999998,"Better",78.812569999999994,83.606660000000005,21.314398401420998,1762,0.74,3]
["E02005199","Chorley 011","Chorley","Female",81.192300000000003,"Better",79.109719999999996,83.274879999999996,7.43585365513393,1773,0.73799999999999999,5]
["E02005297","South Ribble 011","South Ribble","Female",81.068290000000005,"Better",79.407470000000004,82.729110000000006,6.5980482596889702,1869,0.72399999999999998,5]
["E02005274","Ribble Valley 005","Ribble Valley","Female",80.953999999999994,"Better",78.960260000000005,82.947749999999999,7.0688741050119299,1970,0.70899999999999996,5]
["E02005270","Ribble Valley 001","Ribble Valley","Female",80.936589999999995,"Better",79.380089999999996,82.493089999999995,14.148941813261199,1983,0.70799999999999996,4]
["E02005315","West Lancashire 012","West Lancashire","Female",80.933700000000002,"Better",79.32405,82.543350000000004,7.5284166666666703,1985,0.70699999999999996,5]
["E02005239","Lancaster 019","Lancaster","Female",80.917630000000003,"Better",79.314440000000005,82.520830000000004,10.722785437057,1999,0.70499999999999996,4]
["E02005287","South Ribble 001","South Ribble","Female",80.619919999999993,"NoDiff",78.401250000000005,82.838589999999996,4.0338890332158099,2287,0.66300000000000003,5]
["E02005206","Fylde 004","Fylde","Female",80.555679999999995,"NoDiff",78.642330000000001,82.46902,19.866991875816002,2352,0.65300000000000002,3]
["E02005310","West Lancashire 007","West Lancashire","Female",80.546340000000001,"NoDiff",78.358980000000003,82.733710000000002,12.5222993213766,2361,0.65200000000000002,4]
["E02005328","Wyre 010","Wyre","Female",80.474819999999994,"NoDiff",78.522319999999993,82.427319999999995,10.816095539684699,2432,0.64100000000000001,4]
["E02005253","Preston 001","Preston","Female",80.464730000000003,"NoDiff",78.668319999999994,82.261129999999994,12.963947350485601,2442,0.64,4]
["E02005221","Lancaster 001","Lancaster","Female",80.461860000000001,"Better",78.993099999999998,81.930620000000005,13.848112081952401,2444,0.64,4]
["E02005223","Lancaster 003","Lancaster","Female",80.454740000000001,"NoDiff",78.612319999999997,82.297169999999994,8.4579873120948807,2450,0.63900000000000001,5]
["E02005285","Rossendale 008","Rossendale","Female",80.395079999999993,"NoDiff",78.896180000000001,81.893990000000002,11.267816722301699,2520,0.628,4]
["E02005247","Pendle 008","Pendle","Female",80.334789999999998,"NoDiff",78.758740000000003,81.910830000000004,9.9564119490497394,2577,0.62,5]
["E02005205","Fylde 003","Fylde","Female",80.265219999999999,"NoDiff",78.477549999999994,82.052890000000005,12.3559694023904,2643,0.61,4]
["E02005202","Chorley 014","Chorley","Female",80.255769999999998,"NoDiff",78.249499999999998,82.262039999999999,12.3426453767481,2651,0.60899999999999999,4]
["E02005192","Chorley 004","Chorley","Female",80.250860000000003,"NoDiff",78.490399999999994,82.011330000000001,9.0612959223300997,2659,0.60799999999999998,5]
["E02005325","Wyre 007","Wyre","Female",80.200789999999998,"NoDiff",78.487350000000006,81.914230000000003,10.0994689303151,2703,0.60199999999999998,4]
["E02005196","Chorley 008","Chorley","Female",80.041709999999995,"NoDiff",78.283580000000001,81.79983,14.293263757115801,2847,0.57999999999999996,4]
["E02005260","Preston 008","Preston","Female",80.034239999999997,"NoDiff",78.342510000000004,81.725980000000007,12.6071108670182,2852,0.57999999999999996,4]
["E02005295","South Ribble 009","South Ribble","Female",80.012619999999998,"NoDiff",78.316209999999998,81.709019999999995,13.296977100271,2872,0.57699999999999996,4]
["E02005225","Lancaster 005","Lancaster","Female",79.968170000000001,"NoDiff",77.184309999999996,82.752020000000002,10.4246475363413,2913,0.57099999999999995,4]
["E02005306","West Lancashire 003","West Lancashire","Female",79.952590000000001,"NoDiff",78.214429999999993,81.690759999999997,18.291209466122002,2935,0.56699999999999995,3]
["E02005211","Fylde 009","Fylde","Female",79.943700000000007,"NoDiff",78.340479999999999,81.546909999999997,9.41611265808098,2948,0.56499999999999995,5]
["E02005258","Preston 006","Preston","Female",79.938689999999994,"NoDiff",78.514200000000002,81.363190000000003,13.299243102162601,2954,0.56499999999999995,4]
["E02005291","South Ribble 005","South Ribble","Female",79.927840000000003,"NoDiff",78.118840000000006,81.736840000000001,13.145957708779401,2967,0.56299999999999994,4]
["E02005309","West Lancashire 006","West Lancashire","Female",79.900310000000005,"NoDiff",78.235870000000006,81.564760000000007,10.7652354831033,3000,0.55800000000000005,4]
["E02005191","Chorley 003","Chorley","Female",79.751919999999998,"NoDiff",77.859889999999993,81.643950000000004,10.645991926738199,3140,0.53700000000000003,4]
["E02005318","West Lancashire 015","West Lancashire","Female",79.740110000000001,"NoDiff",77.989019999999996,81.491200000000006,14.5920725331874,3152,0.53500000000000003,4]
["E02005307","West Lancashire 004","West Lancashire","Female",79.625749999999996,"NoDiff",78.069010000000006,81.182490000000001,13.426342627753099,3259,0.52,4]
["E02005250","Pendle 011","Pendle","Female",79.592939999999999,"NoDiff",77.196929999999995,81.988939999999999,40.494398893748397,3291,0.51500000000000001,1]
["E02006871","Lancaster 020","Lancaster","Female",79.470460000000003,"NoDiff",77.949259999999995,80.991669999999999,21.535563094536599,3390,0.5,3]
["E02005186","Burnley 011","Burnley","Female",79.355069999999998,"NoDiff",77.195449999999994,81.514679999999998,17.564248715824402,3503,0.48399999999999999,3]
["E02005242","Pendle 003","Pendle","Female",79.332390000000004,"NoDiff",76.980800000000002,81.683989999999994,17.065144397939498,3532,0.47899999999999998,3]
["E02005240","Pendle 001","Pendle","Female",79.325159999999997,"NoDiff",76.893159999999995,81.757149999999996,19.590041897379098,3540,0.47799999999999998,3]
["E02005190","Chorley 002","Chorley","Female",79.317369999999997,"NoDiff",77.525109999999998,81.109629999999996,10.9036474750724,3551,0.47699999999999998,4]
["E02005276","Ribble Valley 007","Ribble Valley","Female",79.303370000000001,"NoDiff",77.322929999999999,81.283820000000006,10.355099488278,3565,0.47499999999999998,4]
["E02005305","West Lancashire 002","West Lancashire","Female",79.299679999999995,"NoDiff",77.348150000000004,81.251220000000004,17.342583240843499,3569,0.47399999999999998,3]
["E02005193","Chorley 005","Chorley","Female",79.28537,"NoDiff",77.482129999999998,81.088610000000003,8.2881943420896196,3581,0.47199999999999998,5]
["E02005203","Fylde 001","Fylde","Female",79.180700000000002,"NoDiff",77.020359999999997,81.341030000000003,13.129877813060901,3660,0.46100000000000002,4]
["E02005308","West Lancashire 005","West Lancashire","Female",79.094679999999997,"NoDiff",76.999110000000002,81.190250000000006,7.4957936794582398,3719,0.45200000000000001,5]
["E02005298","South Ribble 012","South Ribble","Female",79.034959999999998,"NoDiff",76.743129999999994,81.326779999999999,11.970740885054299,3775,0.44400000000000001,4]
["E02005235","Lancaster 015","Lancaster","Female",78.98554,"NoDiff",76.20478,81.766300000000001,14.5971932743363,3828,0.436,4]
["E02005194","Chorley 006","Chorley","Female",78.923180000000002,"NoDiff",76.849450000000004,80.996899999999997,23.679056768559001,3889,0.42699999999999999,2]
["E02005272","Ribble Valley 003","Ribble Valley","Female",78.880399999999995,"NoDiff",77.293980000000005,80.466819999999998,17.6451197116039,3931,0.42099999999999999,3]
["E02005209","Fylde 007","Fylde","Female",78.834680000000006,"NoDiff",76.931100000000001,80.73827,11.7933053543714,3958,0.41699999999999998,4]
["E02005220","Hyndburn 009","Hyndburn","Female",78.804320000000004,"NoDiff",76.823300000000003,80.785340000000005,17.475987313312999,3978,0.41399999999999998,3]
["E02005271","Ribble Valley 002","Ribble Valley","Female",78.77516,"NoDiff",76.828940000000003,80.721379999999996,9.4090805253382896,4003,0.41,5]
["E02005212","Hyndburn 001","Hyndburn","Female",78.730080000000001,"NoDiff",77.049139999999994,80.411019999999994,26.0977321610366,4038,0.40500000000000003,2]
["E02005301","South Ribble 015","South Ribble","Female",78.608900000000006,"NoDiff",76.302710000000005,80.915099999999995,23.927578536889701,4134,0.39100000000000001,2]
["E02005299","South Ribble 013","South Ribble","Female",78.572000000000003,"NoDiff",76.548169999999999,80.595820000000003,17.404598467223199,4166,0.38600000000000001,3]
["E02005198","Chorley 010","Chorley","Female",78.547579999999996,"NoDiff",76.542519999999996,80.552639999999997,25.853659296718799,4192,0.38200000000000001,2]
["E02005292","South Ribble 006","South Ribble","Female",78.530420000000007,"NoDiff",75.978470000000002,81.082359999999994,21.205032642487001,4205,0.38,3]
["E02005294","South Ribble 008","South Ribble","Female",78.527469999999994,"NoDiff",76.359769999999997,80.695170000000005,18.2440584914537,4209,0.38,3]
["E02005259","Preston 007","Preston","Female",78.509439999999998,"NoDiff",76.747649999999993,80.271230000000003,32.769606140608197,4228,0.377,1]
["E02005207","Fylde 005","Fylde","Female",78.340159999999997,"NoDiff",75.862089999999995,80.818219999999997,12.708819442724501,4357,0.35799999999999998,4]
["E02005300","South Ribble 014","South Ribble","Female",78.339179999999999,"NoDiff",76.331180000000003,80.347179999999994,13.8580818094321,4358,0.35799999999999998,4]
["E02005176","Burnley 001","Burnley","Female",78.299679999999995,"NoDiff",76.785929999999993,79.81344,19.819664697193499,4390,0.35299999999999998,3]
["E02005331","Wyre 013","Wyre","Female",78.211979999999997,"NoDiff",76.123999999999995,80.299949999999995,13.2903261969638,4444,0.34499999999999997,4]
["E02005281","Rossendale 004","Rossendale","Female",78.196799999999996,"NoDiff",76.462860000000006,79.93074,24.9718167589694,4462,0.34200000000000003,2]
["E02005204","Fylde 002","Fylde","Female",78.149339999999995,"NoDiff",76.615660000000005,79.683019999999999,12.865544711538501,4495,0.33800000000000002,4]
["E02005329","Wyre 011","Wyre","Female",78.007199999999997,"NoDiff",76.252949999999998,79.761439999999993,19.1497777904328,4597,0.32300000000000001,3]
["E02005201","Chorley 013","Chorley","Female",77.976789999999994,"NoDiff",76.305059999999997,79.648529999999994,18.811322944048101,4626,0.318,3]
["E02005236","Lancaster 016","Lancaster","Female",77.943899999999999,"NoDiff",76.473849999999999,79.41395,22.9657086959871,4643,0.316,2]
["E02005238","Lancaster 018","Lancaster","Female",77.741799999999998,"NoDiff",75.404700000000005,80.078909999999993,15.236604520764001,4778,0.29599999999999999,3]
["E02005180","Burnley 005","Burnley","Female",77.728080000000006,"NoDiff",75.569339999999997,79.886809999999997,16.294016374605,4789,0.29399999999999998,3]
["E02005327","Wyre 009","Wyre","Female",77.629850000000005,"NoDiff",75.254230000000007,80.005459999999999,13.688955304435799,4849,0.28499999999999998,4]
["E02005275","Ribble Valley 006","Ribble Valley","Female",77.543970000000002,"NoDiff",75.297780000000003,79.79016,8.8168366228070205,4908,0.27700000000000002,5]
["E02005293","South Ribble 007","South Ribble","Female",77.537450000000007,"Worse",75.878860000000003,79.19605,18.438456552706601,4913,0.27600000000000002,3]
["E02005322","Wyre 004","Wyre","Female",77.474720000000005,"Worse",75.774420000000006,79.175020000000004,15.660088918046,4945,0.27100000000000002,3]
["E02005237","Lancaster 017","Lancaster","Female",77.446889999999996,"Worse",75.833839999999995,79.059939999999997,16.195255607193399,4960,0.26900000000000002,3]
["E02005214","Hyndburn 003","Hyndburn","Female",77.364739999999998,"Worse",75.323660000000004,79.405820000000006,27.513310519062902,5011,0.26100000000000001,2]
["E02005264","Preston 012","Preston","Female",77.338329999999999,"Worse",75.508409999999998,79.16825,26.747991424220601,5032,0.25800000000000001,2]
["E02005234","Lancaster 014","Lancaster","Female",77.337059999999994,"NoDiff",75.090379999999996,79.583740000000006,24.4735193995675,5036,0.25800000000000001,2]
["E02005326","Wyre 008","Wyre","Female",77.288659999999993,"Worse",75.615359999999995,78.961950000000002,26.462692595625199,5073,0.252,2]
["E02005284","Rossendale 007","Rossendale","Female",77.197770000000006,"Worse",75.436620000000005,78.958920000000006,11.883455561285899,5124,0.245,4]
["E02005286","Rossendale 009","Rossendale","Female",77.174430000000001,"Worse",75.16319,79.185670000000002,22.248180430164599,5138,0.24299999999999999,2]
["E02005213","Hyndburn 002","Hyndburn","Female",77.103729999999999,"Worse",75.606920000000002,78.600530000000006,24.302401128472201,5186,0.23599999999999999,2]
["E02005233","Lancaster 013","Lancaster","Female",77.086699999999993,"Worse",75.216430000000003,78.956959999999995,23.8869621056241,5197,0.23400000000000001,2]
["E02005268","Preston 016","Preston","Female",77.051190000000005,"Worse",75.002650000000003,79.099729999999994,36.979018591729897,5217,0.23100000000000001,1]
["E02005323","Wyre 005","Wyre","Female",77.008340000000004,"Worse",74.92577,79.090909999999994,32.615708086214397,5239,0.22800000000000001,1]
["E02005256","Preston 004","Preston","Female",76.902460000000005,"Worse",75.061300000000003,78.743629999999996,8.6745425638100695,5287,0.221,5]
["E02005224","Lancaster 004","Lancaster","Female",76.891390000000001,"Worse",74.55959,79.223200000000006,18.271609230769201,5292,0.22,3]
["E02005246","Pendle 007","Pendle","Female",76.882540000000006,"Worse",74.379050000000007,79.386030000000005,43.5376888626989,5296,0.219,1]
["E02005228","Lancaster 008","Lancaster","Female",76.86918,"Worse",74.685609999999997,79.052750000000003,29.9261722289469,5305,0.218,2]
["E02005251","Pendle 012","Pendle","Female",76.728380000000001,"Worse",74.463149999999999,78.993600000000001,24.6608576579175,5378,0.20699999999999999,2]
["E02005267","Preston 015","Preston","Female",76.632159999999999,"Worse",73.922910000000002,79.341409999999996,41.057928929519299,5427,0.2,1]
["E02005280","Rossendale 003","Rossendale","Female",76.56617,"Worse",74.816980000000001,78.315359999999998,31.522135249950601,5458,0.19600000000000001,2]
["E02005262","Preston 010","Preston","Female",76.508129999999994,"Worse",74.169449999999998,78.846800000000002,12.2473856240894,5492,0.191,4]
["E02005320","Wyre 002","Wyre","Female",76.498230000000007,"Worse",74.394069999999999,78.60239,24.302705270339398,5498,0.19,2]
["E02006884","Rossendale 010","Rossendale","Female",76.428640000000001,"Worse",74.675700000000006,78.181579999999997,30.470925213675201,5533,0.185,2]
["E02005265","Preston 013","Preston","Female",76.418589999999995,"Worse",74.634320000000002,78.202870000000004,25.303259384728101,5541,0.183,2]
["E02005244","Pendle 005","Pendle","Female",76.361859999999993,"Worse",74.339920000000006,78.383809999999997,31.047051286391302,5570,0.17899999999999999,2]
["E02005278","Rossendale 001","Rossendale","Female",76.312860000000001,"Worse",74.543999999999997,78.081720000000004,12.4134878923767,5601,0.17499999999999999,4]
["E02005279","Rossendale 002","Rossendale","Female",76.286590000000004,"Worse",74.565929999999994,78.007239999999996,27.2455664891041,5617,0.17199999999999999,2]
["E02005208","Fylde 006","Fylde","Female",76.174300000000002,"Worse",74.424170000000004,77.924430000000001,25.663278213639099,5680,0.16300000000000001,2]
["E02005219","Hyndburn 008","Hyndburn","Female",76.121669999999995,"Worse",74.161659999999998,78.081680000000006,24.308666785969901,5716,0.158,2]
["E02005179","Burnley 004","Burnley","Female",76.112690000000001,"Worse",74.327759999999998,77.897620000000003,35.513788063063103,5719,0.157,1]
["E02005252","Pendle 013","Pendle","Female",76.080089999999998,"Worse",74.071560000000005,78.088620000000006,31.9358210311152,5733,0.155,2]
["E02005200","Chorley 012","Chorley","Female",75.989419999999996,"Worse",74.268090000000001,77.710759999999993,27.5990711192159,5773,0.14899999999999999,2]
["E02005243","Pendle 004","Pendle","Female",75.772360000000006,"Worse",73.509370000000004,78.035340000000005,35.656894642143101,5887,0.13300000000000001,1]
["E02005189","Chorley 001","Chorley","Female",75.533969999999997,"Worse",73.911180000000002,77.156769999999995,34.781399962880499,6011,0.114,1]
["E02005197","Chorley 009","Chorley","Female",75.512879999999996,"Worse",73.407660000000007,77.618099999999998,31.591734778268901,6014,0.114,2]
["E02005257","Preston 005","Preston","Female",75.316010000000006,"Worse",73.446849999999998,77.185180000000003,35.630125623130603,6068,0.106,1]
["E02005303","South Ribble 017","South Ribble","Female",75.130619999999993,"Worse",72.726150000000004,77.535079999999994,32.054320956576497,6143,9.5000000000000001E-2,2]
["E02005249","Pendle 010","Pendle","Female",74.98527,"Worse",73.129959999999997,76.840580000000003,47.855461701003698,6192,8.7999999999999995E-2,1]
["E02005230","Lancaster 010","Lancaster","Female",74.983159999999998,"Worse",72.528729999999996,77.437600000000003,38.511172877214399,6193,8.6999999999999994E-2,1]
["E02005321","Wyre 003","Wyre","Female",74.981290000000001,"Worse",72.095770000000002,77.866810000000001,33.7100836852808,6194,8.6999999999999994E-2,1]
["E02005218","Hyndburn 007","Hyndburn","Female",74.978449999999995,"Worse",72.892189999999999,77.064710000000005,29.849492922008501,6195,8.6999999999999994E-2,2]
["E02006881","Burnley 014","Burnley","Female",74.859440000000006,"Worse",73.082610000000003,76.636259999999993,34.900270427625003,6232,8.2000000000000003E-2,1]
["E02005181","Burnley 006","Burnley","Female",74.859009999999998,"Worse",72.531890000000004,77.186139999999995,36.820134277894098,6234,8.1000000000000003E-2,1]
["E02005317","West Lancashire 014","West Lancashire","Female",74.841399999999993,"Worse",72.758319999999998,76.924490000000006,53.235831657935698,6239,8.1000000000000003E-2,1]
["E02005231","Lancaster 011","Lancaster","Female",74.711299999999994,"Worse",72.765659999999997,76.656940000000006,39.335361083374899,6280,7.4999999999999997E-2,1]
["E02005263","Preston 011","Preston","Female",74.701480000000004,"Worse",72.507260000000002,76.895700000000005,33.761161335578002,6285,7.3999999999999996E-2,1]
["E02005183","Burnley 008","Burnley","Female",74.242369999999994,"Worse",71.788889999999995,76.695849999999993,30.254454425363299,6430,5.2999999999999999E-2,2]
["E02005215","Hyndburn 004","Hyndburn","Female",74.218270000000004,"Worse",72.499399999999994,75.937129999999996,34.640656410688699,6432,5.1999999999999998E-2,1]
["E02005316","West Lancashire 013","West Lancashire","Female",74.085260000000005,"Worse",71.919690000000003,76.250820000000004,42.318940476190498,6466,4.7E-2,1]
["E02005269","Preston 017","Preston","Female",74.007320000000007,"Worse",71.899420000000006,76.115219999999994,37.784017138302097,6488,4.3999999999999997E-2,1]
["E02005319","Wyre 001","Wyre","Female",73.818029999999993,"Worse",71.92013,75.71593,48.033303547482603,6518,0.04,1]
["E02005216","Hyndburn 005","Hyndburn","Female",73.729680000000002,"Worse",71.425409999999999,76.033950000000004,40.079323177570103,6530,3.7999999999999999E-2,1]
["E02005217","Hyndburn 006","Hyndburn","Female",73.72578,"Worse",71.983630000000005,75.467920000000007,55.820550399201601,6532,3.7999999999999999E-2,1]
["E02005313","West Lancashire 010","West Lancashire","Female",73.654929999999993,"Worse",71.930940000000007,75.378910000000005,43.0669329737174,6544,3.5999999999999997E-2,1]
["E02005314","West Lancashire 011","West Lancashire","Female",73.595370000000003,"Worse",71.211969999999994,75.978769999999997,26.205373025704599,6550,3.5000000000000003E-2,2]
["E02005178","Burnley 003","Burnley","Female",73.525149999999996,"Worse",71.399730000000005,75.650559999999999,58.716808873720097,6563,3.3000000000000002E-2,1]
["E02005177","Burnley 002","Burnley","Female",73.040689999999998,"Worse",70.441940000000002,75.639439999999993,37.581845264792101,6607,2.5999999999999999E-2,1]
["E02005261","Preston 009","Preston","Female",72.946349999999995,"Worse",71.232600000000005,74.660089999999997,52.324787160833701,6615,2.5000000000000001E-2,1]
["E02005266","Preston 014","Preston","Female",72.911959999999993,"Worse",70.902360000000002,74.921549999999996,49.693403234020899,6621,2.4E-2,1]
["E02005185","Burnley 010","Burnley","Female",72.866780000000006,"Worse",71.092500000000001,74.641050000000007,64.437053687315597,6623,2.4E-2,1]
["E02005248","Pendle 009","Pendle","Female",72.628469999999993,"Worse",70.087670000000003,75.169280000000001,51.442249578156201,6647,2.1000000000000001E-2,1]
["E02005229","Lancaster 009","Lancaster","Female",71.938149999999993,"Worse",69.531189999999995,74.345119999999994,58.932956452750403,6702,1.2E-2,1]
["E02005226","Lancaster 006","Lancaster","Female",71.30959,"Worse",69.358639999999994,73.260540000000006,50.502267621703901,6733,8.0000000000000002E-3,1]
["E02005182","Burnley 007","Burnley","Female",70.490009999999998,"Worse",67.870760000000004,73.109260000000006,52.996266394835203,6765,3.0000000000000001E-3,1]